{"text_format":"1","workbook":"xlsx","n_sheets":3,"sheets":["Forrás","SIRCO","MAKRÓ engedélyezése segítség"],"not_rendered":{"charts":0,"images":5,"macros":1,"external_links":0,"defined_names":3,"comments":0,"pivot_tables":0},"unopened":[],"bounds":{"document_bytes":16777216,"sheet_cells":100000,"rows_first":2000,"rows_last":500,"rows_between":2000,"halvings":0,"cell_chars":16384,"cell_head_chars":4096},"cells_cut":0,"cells_raw":0,"read":"whole","date_system":"1900"}

{"sheet":"Forrás","index":0,"n_rows":111,"n_cols":8,"rows_kept":111,"cut":false,"hidden":true,"merged":[]}
[]
[]
[]
[]
[]
[]
[]
[]
[]
[]
["Áramerősség"]
["Kérem válasszon!"]
[16,"SIRCO szakaszoló M1 méret 3X16A (hajtás nélkül)",22003000,3700.5743305551005,null,"pólus bővítő M1 méret 16A (kapcsolható)",22001000,1341.0800707461285]
[20,"SIRCO szakaszoló M1 méret 3X20A (hajtás nélkül)",22003001,4013.1569034357758,null,"pólus bővítő M1 méret 20A (kapcsolható)",22001001,1341.0800707461285]
[25,"SIRCO szakaszoló M1 méret 3X25A (hajtás nélkül)",22003002,4527.4056523685022,null,"pólus bővítő M1 méret 25A (kapcsolható)",22001002,1441.9131587721508]
[32,"SIRCO szakaszoló M1 méret 3X32A (hajtás nélkül)",22003003,5142.4874893272527,null,"pólus bővítő M1 méret 32A (kapcsolható)",22001003,1643.5793348242003]
[40,"SIRCO szakaszoló M1 méret 3X40A (hajtás nélkül)",22003004,5455.0700622079275,null,"pólus bővítő M1 méret 40A (kapcsolható)",22001004,1643.5793348242003]
[63,"SIRCO szakaszoló M2 méret 3X63A (hajtás nélkül)",22003006,7713.7312339908813,null,"pólus bővítő M2 méret 63A (kapcsolható)",22001006,2258.6611717829501]
[80,"SIRCO szakaszoló M2 méret 3X80A (hajtás nélkül)",22003008,8328.8130709496272,null,"pólus bővítő M2 méret 80A (kapcsolható)",22001008,2470.4106566376017]
[100,"SIRCO szakaszoló M3 méret 3X100A (hajtás nélkül)",22003010,11999.137475096919,null,"pólus bővítő M3 méret 100A (kapcsolható)",22001010,3498.9081545030526]
[125,"SIRCO szakaszoló M3 méret 3X125A (hajtás nélkül)",22003011,13410.800707461261,null,"pólus bővítő M3 méret 125A (kapcsolható)",22001011,3912.323815409753]
[]
["Pólusok száma","Mennyiség kapcsoló mechanizmus",null,null,null,"Mennyiség pőlus bővítő"]
["Kérem válasszon!"]
[3,1,null,null,null,0]
[4,1,null,null,null,1]
[6,2,null,null,null,0]
[8,2,null,null,null,2]
[]
[]
["Hajtás típusa"]
["Kérem válasszon!"]
["Direkt","Nincs kivezetett halytásra szükség!","Nincs tengelyre szükség!"]
["Kivezetett","Nincs direkt halytásra szükség!"]
[]
[]
["Kérem válasszon!"]
[]
["Direkt hajtás színe"]
["Kérem válasszon!"]
["Kék","Direkt hajtás (kék kar) M1 vagy M2",22995012,395.42387461186087,1]
["Piros","Direkt hajtás (piros kar) M1 vagy M2     ",22995013,395.42387461186087,1]
["Kék nagykar 100A vagy 125A","Direkt hajtás (kék kar) M3",22995032,593,1]
[]
[]
[]
["Kivezetett hajtás színe"]
["Kérem válasszon!"]
["Kék","Kivezetett hajtás E S00N-65/típus3R,12 D (kék) M1/M2",14731111,1541.8377969999999,1]
["Piros","Kivezetett hajtás E S00R-65/típus3R,12 D (piros) M1/M2",14741111,1541.8377969999999,1]
["Kék nagykar 100A vagy 125A","Kivezetett hajtás E S0N-65/típus 3R,12 D (kék) M3",14831111,1977.1193730593047,1]
["Piros nagykar 100A vagy 125A","Kivezetett hajtás E S0R-65/típus 3R,12 D (piros) M3",14841111,1977.1193730593047,1]
[]
[]
[]
["Tengely hosszúsága"]
["Kérem válasszon!"]
["150mm","Tengely típus S-5X5-150MM          ",14070515,606.25660950000008,1]
["200mm","Tengely típus S-5X5-200MM          ",14070520,1145.1513735000001,1]
["320mm","Tengely típus S-5X5-320MM          ",14070532,1167.6053219999999,1]
["150mm (Nagy tengely 6/8 pólusú kapcsolóhoz)","Tengely típus S-6X6-150MM          ",14090615,621.22590849999995,1]
["200mm (Nagy tengely 6/8 pólusú kapcsolóhoz)","Tengely típus S-6X6-200MM          ",14090620,823.31144500000016,1]
["320mm (Nagy tengely 6/8 polusú kapcsolóhoz)","Tengely típus S-6X6-320MM          ",14090632,1354.7215595000002,1]
[]
["Átalakító készlet"]
["Kérem válasszon!"]
["Átalakító készlet M1 - M2","Átalakító készlet 6/8P   M1-M2 méret",22696009,4231.0354583469125,1]
["Átalakító készlet M3","Átalakító készlet 6/8P   M3 méret",22696011,16331.505209000003,1]
[]
[]
["Segédérintkező"]
["Kérem válasszon!"]
["NO+NC váltó érintkező","Segédérintkező  NO+NC váltó érintkező",22990001,2421.9712319976484,1]
["2db NO záró érintkező","Segédérintkező  2db NO záró érintkező      ",22990011,2421.9712319976484,1]
["Nincs szükségem segédérintkezőre."]
[]
["Érintésvédelmi burkolat"]
["Kérem válasszon!"]
["Igen","Érintésvédelmi burkolat 1P M1 méret ",22941005,197.71193730593043,1]
["Nem","Érintésvédelmi burkolat 1P M2 méret ",22941009,306.4535028241923,1]
[null,"Érintésvédelmi burkolat 1P M3 méret ",22941011,504.1654401301227,1]
[null,"Érintésvédelmi burkolat 3P M1 méret ",22943005,701.87737743605283,1,2]
[null,"Érintésvédelmi burkolat 3P M2 méret ",22943009,1008.3308802602454,1,2]
[null,"Érintésvédelmi burkolat 3P M3 és MV méret ",22943016,1512.4963203903683,1]
[]
[]
["Átkapcsoló I-0-II"]
["Kérem válasszon!"]
["Átlakaító készlet I-0-II M1-M2 méret","Átalakító készlet I-0-II   M1-M2 méret",22096009,5140.5103699541914,1]
["Átalakító készlet I-0-II M3 méret","Átalakító készlet I-0-II   M3 méret",22096011,18898.739987499997,1]
[]
["Átkapcsoló I-I+II-II"]
["Kérem válasszon!"]
["Átlakaító készlet I-I+II-II M1-M2 méret","Átalakító készlet I-I+II-II  M1-M2 méret",22996009,5951.1293129085079,1]
["Átalakító készlet I-I+II-II M3 méret","Átalakító készlet I-I+II-II  M3 méret",22996011,22304.255509999999,1]
[]
["Konfigurálni kívánt eszköz:"]
["Kérem válasszon!"]
["Kapcsoló 0-I"]
["Átkapcsoló I-0-II"]
["Átkapcsoló I-I+II-II"]
[]
["Átkapcsoló kar I-0-II"]
["Kérem válasszon!"]
["Kar kék I-0-II","Kivezetett hajtás FE S00N-65 D-G  (kék) I-0-II M1/M2",14731113,1654.1075394999998,1]
["Kar kék nagy I-0-II","Kivezetett hajtás FE S00N-65 D-G 6MM (kék) I-0-II M3",14730113,1848.7084265000001,1]
[]
[]
["Átkapcsoló kar I-I+II-II"]
["Kar piros I-I+II-II","Kivezetett hajtás FE S00N-65 D-J (kék) I-I+II-II M1/M2",14731114,1654,1]
["Kar piros nagy I-I+II-II","Kivezetett hajtás FE S00N-65 D-J (kék) I-I+II-II M3",14730114,1849,1]

{"sheet":"SIRCO","index":1,"n_rows":38,"n_cols":16,"rows_kept":38,"cut":false,"hidden":false,"merged":[[12,2,13,2],[37,10,37,14],[22,10,22,15],[4,10,8,15],[23,10,23,11],[9,10,9,15],[21,10,21,14],[23,12,23,15],[2,1,4,1],[8,1,9,1],[8,2,9,2],[8,3,9,3],[8,4,9,4],[1,6,1,7],[11,5,12,5],[8,6,9,6],[8,7,9,7],[11,4,12,4],[0,3,1,5]]}
[null,null,null,"A segédletben szereplő árak érvényessége 2024.06.30.\nEzt követően kérem töltse le a friss verziót innen:\nhttp://corecommsi.hu/_oldweb/pdf/SIRCO-kapcsoló_választó_20231120.xlsm"]
[null,null,null,null,null,null,{"$f":"IF(OR(C11=\"Kérem válasszon!\",B6=\"Kérem válasszon!\",B6=\"Kapcsoló 0-I\"),\"\",IF(AND(B6=\"Átkapcsoló I-0-II\",C11<=4),\"\",IF(AND(B6=\"Átkapcsoló I-I+II-II\",C11<=4),\"\",\"HIBÁS VÁLASZTÁS! Átkapcsolóhoz kérem válasszon 3 vagy 4 pólust.\")))","v":""}]
[null,"Konfigurálni kívánt eszköz:\n0. lépés"]
[]
[null,null,null,null,null,null,null,null,null,null,"Megrendelés esetén kérem másolja ki és küldje el az alábbi kalkuláció megrendelő lapját kollégáinknak a rendeles@corecommsi.hu címre.\n\nMűszaki kérdés esetén keresse kollégánkat:\nNév: Banos Károly\nTelefonszám: +36-30-503-0172        E-mail: banos.karoly@corecommsi.hu"]
[null,"Kérem válasszon!"]
[]
[]
[null,"Áramerősség\n1. lépés","Pólusok száma\n2. lépés","Hajtás típusa\n3. lépés","Hajtás színe\n4. lépés",null,"Segédérintkező\n(Opcionális tétel)","Érintésvédelmi burkolat\n(Opcionális tétel)"]
[null,null,null,null,null,null,null,null,null,null,"SOCOMEC SIRCO kapcsolók"]
[null,"Kérem válasszon!","Kérem válasszon!","Kérem válasszon!","Kérem válasszon!",null,"Kérem válasszon!","Kérem válasszon!",null,null,"Eszközök","Leírás","Cikkszám","Nettó listaár","Mennyiség","Nettó mennyiségi listaár"]
[null,null,null,null,"Kivezetett hajtás színe","Tangely hosszúsága",null,null,null,null,"Kapcsoló mechanizmus:",{"$f":"IF(B11=\"Kérem válasszon!\",\"\",IF(AND(B6=\"Átkapcsoló I-0-II\",C11>=6),\"\",IF(AND(B6=\"Átkapcsoló I-I+II-II\",C11>=6),\"\",VLOOKUP(B11,Forrás!A12:D21,2,0))))","v":""},{"$f":"IF(B11=\"Kérem válasszon!\",\"\",IF(AND(B6=\"Átkapcsoló I-0-II\",C11>=6),\"\",IF(AND(B6=\"Átkapcsoló I-I+II-II\",C11>=6),\"\",VLOOKUP(B11,Forrás!A12:D21,3,0))))","v":""},{"$f":"IF(B11=\"Kérem válasszon!\",\"\",IF(AND(B6=\"Átkapcsoló I-0-II\",C11>=6),\"\",IF(AND(B6=\"Átkapcsoló I-I+II-II\",C11>=6),\"\",VLOOKUP(B11,Forrás!A12:D21,4,0))))","v":""},{"$f":"IF(B11=\"Kérem válasszon!\",\"\",IF(AND(B6=\"Átkapcsoló I-0-II\",C11>=6),\"\",IF(AND(B6=\"Átkapcsoló I-I+II-II\",C11>=6),\"\",IF(OR(B6=\"Átkapcsoló I-0-II\",B6=\"Átkapcsoló I-I+II-II\"),2,VLOOKUP(C11,Forrás!A24:B28,2,0)))))","v":""},{"$f":"IF(N12=\"\",\"\",N12*O12)","v":""}]
[null,null,"Kivezetett hajtás esetén itt folytassa",null,null,null,null,null,null,null,"Pólus bővítő:",{"$f":"IF(B11=\"Kérem válasszon!\",\"\",IF(C11=\"Kérem válasszon!\",\"\",IF(OR(C11=3,C11=6),\"\",IF(AND(B6=\"Átkapcsoló I-0-II\",C11>=6),\"\",IF(AND(B6=\"Átkapcsoló I-I+II-II\",C11>=6),\"\",VLOOKUP(B11,Forrás!A12:H21,6,0))))))","v":""},{"$f":"IF(B11=\"Kérem válasszon!\",\"\",IF(C11=\"Kérem válasszon!\",\"\",IF(OR(C11=3,C11=6),\"\",IF(AND(B6=\"Átkapcsoló I-0-II\",C11>=6),\"\",IF(AND(B6=\"Átkapcsoló I-I+II-II\",C11>=6),\"\",VLOOKUP(B11,Forrás!A12:H21,7,0))))))","v":""},{"$f":"IF(B11=\"Kérem válasszon!\",\"\",IF(C11=\"Kérem válasszon!\",\"\",IF(OR(C11=3,C11=6),\"\",IF(AND(B6=\"Átkapcsoló I-0-II\",C11>=6),\"\",IF(AND(B6=\"Átkapcsoló I-I+II-II\",C11>=6),\"\",VLOOKUP(B11,Forrás!A12:H21,8,0))))))","v":""},{"$f":"IF(B11=\"Kérem válasszon!\",\"\",IF(C11=\"Kérem válasszon!\",\"\",IF(AND(B6=\"Átkapcsoló I-0-II\",C11>=6),\"\",IF(AND(B6=\"Átkapcsoló I-I+II-II\",C11>=6),\"\",IF(OR(C11=3,C11=6),\"\",IF(OR(B6=\"Átkapcsoló I-0-II\",B6=\"Átkapcsoló I-I+II-II\"),2,VLOOKUP(C11,Forrás!A24:F28,6,0)))))))","v":""},""]
[null,null,null,null,"Kérem válasszon!","Kérem válasszon!",null,null,null,null,"Direkt hajtás:",{"$f":"IF(OR(E11=\"Kérem válasszon!\",B6=\"Átkapcsoló I-0-II\",B6=\"Átkapcsoló I-I+II-II\"),\"\",IF(B11=\"Kérem válasszon!\",\"\",IF(C11>=6,\"\",IF(D11=\"Kivezetett\",\"\",IF(AND(E11=\"Piros\",B11>=100),\"Nem létezik PIROS kar M3 méretben, válasszon másikat!\",IF(B11>=100,Forrás!B43,VLOOKUP(E11,Forrás!A40:E42,2,0)))))))","v":""},{"$f":"IF(OR(E11=\"Kérem válasszon!\",B6=\"Átkapcsoló I-0-II\",B6=\"Átkapcsoló I-I+II-II\"),\"\",IF(B11=\"Kérem válasszon!\",\"\",IF(C11>=6,\"\",IF(D11=\"Kivezetett\",\"\",IF(AND(E11=\"Piros\",B11>=100),\"\",IF(B11>=100,Forrás!C43,VLOOKUP(E11,Forrás!A40:E42,3,0)))))))","v":""},{"$f":"IF(OR(E11=\"Kérem válasszon!\",B6=\"Átkapcsoló I-0-II\",B6=\"Átkapcsoló I-I+II-II\"),\"\",IF(B11=\"Kérem válasszon!\",\"\",IF(C11>=6,\"\",IF(D11=\"Kivezetett\",\"\",IF(AND(E11=\"Piros\",B11>=100),\"\",IF(B11>=100,Forrás!D43,VLOOKUP(E11,Forrás!A40:E42,4,0)))))))","v":""},{"$f":"IF(OR(E11=\"Kérem válasszon!\",B6=\"Átkapcsoló I-0-II\",B6=\"Átkapcsoló I-I+II-II\"),\"\",IF(B11=\"Kérem válasszon!\",\"\",IF(C11>=6,\"\",IF(D11=\"Kivezetett\",\"\",IF(AND(E11=\"Piros\",B11>=100),\"\",IF(B11>=100,Forrás!E43,VLOOKUP(E11,Forrás!A40:E42,5,0)))))))","v":""},""]
[null,null,null,null,null,null,null,null,null,null,"Kivezetett hajtás:",{"$f":"IF(D11=\"Kivezetett\",IF(B6=\"Kapcsoló 0-I\",IF(AND(B11<=80,E14=\"Kék\"),Forrás!B49,IF(AND(B11<=80,E14=\"Piros\"),Forrás!B50,IF(AND(B11>=100,E14=\"kék\"),Forrás!B51,IF(AND(B11>=100,E14=\"Piros\"),Forrás!B52,\"\")))),IF(B6=\"Átkapcsoló I-0-II\",IF(AND(B11<=80,E14=\"Kék\"),Forrás!B105,IF(AND(B11<=80,E14=\"Piros\"),\"Nem létezik PIROS kivezetett kar I-0-II átkapcsolóhoz\",IF(AND(B11>=100,E14=\"kék\"),Forrás!B106,IF(AND(B11>=100,E14=\"Piros\"),\"Nem létezik PIROS kivezetett kar I-0-II átkapcsolóhoz\",\"\")))),IF(B6=\"Átkapcsoló I-I+II-II\",IF(AND(B11<=80,E14=\"Kék\"),Forrás!B110,IF(AND(B11<=80,E14=\"Piros\"),\"Nem létezik PIROS kar I-I+II-II átkapcsolóhoz\",IF(AND(B11>=100,E14=\"kék\"),Forrás!B111,IF(AND(B11>=100,E14=\"Piros\"),\"Nem létezik PIROS kar I-I+II-II átkapcsolóhoz\",\"\")))),\"\"))),\"\")","v":""},{"$f":"IF(D11=\"Kivezetett\",IF(B6=\"Kapcsoló 0-I\",IF(AND(B11<=80,E14=\"Kék\"),Forrás!C49,IF(AND(B11<=80,E14=\"Piros\"),Forrás!C50,IF(AND(B11>=100,E14=\"kék\"),Forrás!C51,IF(AND(B11>=100,E14=\"Piros\"),Forrás!C52,\"\")))),IF(B6=\"Átkapcsoló I-0-II\",IF(AND(B11<=80,E14=\"Kék\"),Forrás!C105,IF(AND(B11<=80,E14=\"Piros\"),\"\",IF(AND(B11>=100,E14=\"kék\"),Forrás!C106,IF(AND(B11>=100,E14=\"Piros\"),\"\",\"\")))),IF(B6=\"Átkapcsoló I-I+II-II\",IF(AND(B11<=80,E14=\"Kék\"),Forrás!C110,IF(AND(B11<=80,E14=\"Piros\"),\"\",IF(AND(B11>=100,E14=\"kék\"),Forrás!C111,IF(AND(B11>=100,E14=\"Piros\"),\"\",\"\")))),\"\"))),\"\")","v":""},{"$f":"IF(D11=\"Kivezetett\",IF(B6=\"Kapcsoló 0-I\",IF(AND(B11<=80,E14=\"Kék\"),Forrás!D49,IF(AND(B11<=80,E14=\"Piros\"),Forrás!D50,IF(AND(B11>=100,E14=\"kék\"),Forrás!D51,IF(AND(B11>=100,E14=\"Piros\"),Forrás!D52,\"\")))),IF(B6=\"Átkapcsoló I-0-II\",IF(AND(B11<=80,E14=\"Kék\"),Forrás!D105,IF(AND(B11<=80,E14=\"Piros\"),\"\",IF(AND(B11>=100,E14=\"kék\"),Forrás!D106,IF(AND(B11>=100,E14=\"Piros\"),\"\",\"\")))),IF(B6=\"Átkapcsoló I-I+II-II\",IF(AND(B11<=80,E14=\"Kék\"),Forrás!D110,IF(AND(B11<=80,E14=\"Piros\"),\"\",IF(AND(B11>=100,E14=\"kék\"),Forrás!D111,IF(AND(B11>=100,E14=\"Piros\"),\"\",\"\")))),\"\"))),\"\")","v":""},{"$f":"IF(D11=\"Kivezetett\",IF(B6=\"Kapcsoló 0-I\",IF(AND(B11<=80,E14=\"Kék\"),Forrás!E49,IF(AND(B11<=80,E14=\"Piros\"),Forrás!E50,IF(AND(B11>=100,E14=\"kék\"),Forrás!E51,IF(AND(B11>=100,E14=\"Piros\"),Forrás!E52,\"\")))),IF(B6=\"Átkapcsoló I-0-II\",IF(AND(B11<=80,E14=\"Kék\"),Forrás!E105,IF(AND(B11<=80,E14=\"Piros\"),\"\",IF(AND(B11>=100,E14=\"kék\"),Forrás!E106,IF(AND(B11>=100,E14=\"Piros\"),\"\",\"\")))),IF(B6=\"Átkapcsoló I-I+II-II\",IF(AND(B11<=80,E14=\"Kék\"),Forrás!E110,IF(AND(B11<=80,E14=\"Piros\"),\"\",IF(AND(B11>=100,E14=\"kék\"),Forrás!E111,IF(AND(B11>=100,E14=\"Piros\"),\"\",\"\")))),\"\"))),\"\")","v":""},""]
[null,null,null,null,null,null,null,null,null,null,"Tengely:",{"$f":"IF(D11=\"Kivezetett\",IF(B6=\"Kapcsoló 0-I\",IF(AND(C11<=4,F14=\"150mm\"),Forrás!B58,IF(AND(C11<=4,F14=\"200mm\"),Forrás!B59,IF(AND(C11<=4,F14=\"320mm\"),Forrás!B60,IF(B11>=100,IF(AND(C11>=6,F14=\"150mm\"),Forrás!B61,IF(AND(C11>=6,F14=\"200mm\"),Forrás!B62,IF(AND(C11>=6,F14=\"320mm\"),Forrás!B63,\"\"))),IF(B11 <=80,IF(AND(C11>=6,F14=\"150mm\"),Forrás!B58,IF(AND(C11>=6,F14=\"200mm\"),Forrás!B59,IF(AND(C11>=6,F14=\"320mm\"),Forrás!B60,\"\"))),\"\"))))),IF(OR(B6=\"Átkapcsoló I-0-II\",B6=\"Átkapcsoló I-I+II-II\"),IF(AND(B11<=80,F14=\"150mm\"),Forrás!B58,IF(AND(B11<=80,F14=\"200mm\"),Forrás!B59,IF(AND(B11<=80,F14=\"320mm\"),Forrás!B60,IF(AND(B11>=100,F14=\"150mm\"),Forrás!B61,IF(AND(B11>=100,F14=\"200mm\"),Forrás!B62,IF(AND(B11>=100,F14=\"320mm\"),Forrás!B63,\"\")))))),\"\")),\"\")","v":""},{"$f":"IF(D11=\"Kivezetett\",IF(B6=\"Kapcsoló 0-I\",IF(AND(C11<=4,F14=\"150mm\"),Forrás!C58,IF(AND(C11<=4,F14=\"200mm\"),Forrás!C59,IF(AND(C11<=4,F14=\"320mm\"),Forrás!C60,IF(B11>=100,IF(AND(C11>=6,F14=\"150mm\"),Forrás!C61,IF(AND(C11>=6,F14=\"200mm\"),Forrás!C62,IF(AND(C11>=6,F14=\"320mm\"),Forrás!C63,\"\"))),IF(B11 <=80,IF(AND(C11>=6,F14=\"150mm\"),Forrás!C58,IF(AND(C11>=6,F14=\"200mm\"),Forrás!C59,IF(AND(C11>=6,F14=\"320mm\"),Forrás!C60,\"\"))),\"\"))))),IF(OR(B6=\"Átkapcsoló I-0-II\",B6=\"Átkapcsoló I-I+II-II\"),IF(AND(B11<=80,F14=\"150mm\"),Forrás!C58,IF(AND(B11<=80,F14=\"200mm\"),Forrás!C59,IF(AND(B11<=80,F14=\"320mm\"),Forrás!C60,IF(AND(B11>=100,F14=\"150mm\"),Forrás!C61,IF(AND(B11>=100,F14=\"200mm\"),Forrás!C62,IF(AND(B11>=100,F14=\"320mm\"),Forrás!C63,\"\")))))),\"\")),\"\")","v":""},{"$f":"IF(D11=\"Kivezetett\",IF(B6=\"Kapcsoló 0-I\",IF(AND(C11<=4,F14=\"150mm\"),Forrás!D58,IF(AND(C11<=4,F14=\"200mm\"),Forrás!D59,IF(AND(C11<=4,F14=\"320mm\"),Forrás!D60,IF(B11>=100,IF(AND(C11>=6,F14=\"150mm\"),Forrás!D61,IF(AND(C11>=6,F14=\"200mm\"),Forrás!D62,IF(AND(C11>=6,F14=\"320mm\"),Forrás!D63,\"\"))),IF(B11 <=80,IF(AND(C11>=6,F14=\"150mm\"),Forrás!D58,IF(AND(C11>=6,F14=\"200mm\"),Forrás!D59,IF(AND(C11>=6,F14=\"320mm\"),Forrás!D60,\"\"))),\"\"))))),IF(OR(B6=\"Átkapcsoló I-0-II\",B6=\"Átkapcsoló I-I+II-II\"),IF(AND(B11<=80,F14=\"150mm\"),Forrás!D58,IF(AND(B11<=80,F14=\"200mm\"),Forrás!D59,IF(AND(B11<=80,F14=\"320mm\"),Forrás!D60,IF(AND(B11>=100,F14=\"150mm\"),Forrás!D61,IF(AND(B11>=100,F14=\"200mm\"),Forrás!D62,IF(AND(B11>=100,F14=\"320mm\"),Forrás!D63,\"\")))))),\"\")),\"\")","v":""},{"$f":"IF(D11=\"Kivezetett\",IF(B6=\"Kapcsoló 0-I\",IF(AND(C11<=4,F14=\"150mm\"),Forrás!E58,IF(AND(C11<=4,F14=\"200mm\"),Forrás!E59,IF(AND(C11<=4,F14=\"320mm\"),Forrás!E60,IF(B11>=100,IF(AND(C11>=6,F14=\"150mm\"),Forrás!E61,IF(AND(C11>=6,F14=\"200mm\"),Forrás!E62,IF(AND(C11>=6,F14=\"320mm\"),Forrás!E63,\"\"))),IF(B11 <=80,IF(AND(C11>=6,F14=\"150mm\"),Forrás!E58,IF(AND(C11>=6,F14=\"200mm\"),Forrás!E59,IF(AND(C11>=6,F14=\"320mm\"),Forrás!E60,\"\"))),\"\"))))),IF(OR(B6=\"Átkapcsoló I-0-II\",B6=\"Átkapcsoló I-I+II-II\"),IF(AND(B11<=80,F14=\"150mm\"),Forrás!E58,IF(AND(B11<=80,F14=\"200mm\"),Forrás!E59,IF(AND(B11<=80,F14=\"320mm\"),Forrás!E60,IF(AND(B11>=100,F14=\"150mm\"),Forrás!E61,IF(AND(B11>=100,F14=\"200mm\"),Forrás!E62,IF(AND(B11>=100,F14=\"320mm\"),Forrás!E63,\"\")))))),\"\")),\"\")","v":""},""]
[null,null,null,null,null,null,null,null,null,null,"Átalakító készlet:",{"$f":"IF(C11=\"Kérem válasszon!\",\"\",IF(B6=\"Kapcsoló 0-I\",IF(AND(C11>=6,B11<=80),Forrás!B67,IF(AND(B11>=100,C11>=6),Forrás!B68,\"\")),IF(B6=\"Átkapcsoló I-0-II\",IF(AND(B11>=100,C11<=4),Forrás!B90,IF(C11<=4,Forrás!B89,\"\")),IF(B6=\"Átkapcsoló I-I+II-II\",IF(AND(B11>=100,C11<=4),Forrás!B95,IF(C11<=4,Forrás!B94,\"\")),\"\"))))","v":""},{"$f":"IF(C11=\"Kérem válasszon!\",\"\",IF(B6=\"Kapcsoló 0-I\",IF(AND(C11>=6,B11<=80),Forrás!C67,IF(AND(B11>=100,C11>=6),Forrás!C68,\"\")),IF(B6=\"Átkapcsoló I-0-II\",IF(AND(B11>=100,C11<=4),Forrás!C90,IF(C11<=4,Forrás!C89,\"\")),IF(B6=\"Átkapcsoló I-I+II-II\",IF(AND(B11>=100,C11<=4),Forrás!C95,IF(C11<=4,Forrás!C94,\"\")),\"\"))))","v":""},{"$f":"IF(C11=\"Kérem válasszon!\",\"\",IF(B6=\"Kapcsoló 0-I\",IF(AND(C11>=6,B11<=80),Forrás!D67,IF(AND(B11>=100,C11>=6),Forrás!D68,\"\")),IF(B6=\"Átkapcsoló I-0-II\",IF(AND(B11>=100,C11<=4),Forrás!D90,IF(C11<=4,Forrás!D89,\"\")),IF(B6=\"Átkapcsoló I-I+II-II\",IF(AND(B11>=100,C11<=4),Forrás!D95,IF(C11<=4,Forrás!D94,\"\")),\"\"))))","v":""},{"$f":"IF(C11=\"Kérem válasszon!\",\"\",IF(B6=\"Kapcsoló 0-I\",IF(AND(C11>=6,B11<=80),Forrás!E67,IF(AND(B11>=100,C11>=6),Forrás!E68,\"\")),IF(B6=\"Átkapcsoló I-0-II\",IF(AND(B11>=100,C11<=4),Forrás!E90,IF(C11<=4,Forrás!E89,\"\")),IF(B6=\"Átkapcsoló I-I+II-II\",IF(AND(B11>=100,C11<=4),Forrás!E95,IF(C11<=4,Forrás!E94,\"\")),\"\"))))","v":""},""]
[null,null,null,null,null,null,null,null,null,null,"Segédérintkező:",{"$f":"IF(B11=\"Kérem válasszon!\",\"\",IF(G11=\"NO+NC váltó érintkező\",Forrás!B73,IF(G11=\"2db NO záró érintkező\",Forrás!B74,IF(G11=\"Nincs szükségem segédérintkezőre.\",\"\",\"\"))))","v":""},{"$f":"IF(B11=\"Kérem válasszon!\",\"\",IF(G11=\"NO+NC váltó érintkező\",Forrás!C73,IF(G11=\"2db NO záró érintkező\",Forrás!C74,IF(G11=\"Nincs szükségem segédérintkezőre.\",\"\",\"\"))))","v":""},{"$f":"IF(B11=\"Kérem válasszon!\",\"\",IF(G11=\"NO+NC váltó érintkező\",Forrás!D73,IF(G11=\"2db NO záró érintkező\",Forrás!D74,IF(G11=\"Nincs szükségem segédérintkezőre.\",\"\",\"\"))))","v":""},{"$f":"IF(B11=\"Kérem válasszon!\",\"\",IF(G11=\"NO+NC váltó érintkező\",Forrás!E73,IF(G11=\"2db NO záró érintkező\",Forrás!E74,IF(G11=\"Nincs szükségem segédérintkezőre.\",\"\",\"\"))))","v":""},""]
[null,null,null,null,null,null,null,null,null,null,"Érintésvédelmi burkolat 3P",{"$f":"IF(B11=\"Kérem válasszon!\",\"\",IF(H11=\"Igen\",IF(B11<=40,Forrás!B82,IF(AND(B11>40,B11<=80),Forrás!B83,IF(B11>=100,Forrás!B84,\"\"))),\"\"))","v":""},{"$f":"IF(B11=\"Kérem válasszon!\",\"\",IF(H11=\"Igen\",IF(B11<=40,Forrás!C82,IF(AND(B11>40,B11<=80),Forrás!C83,IF(B11>=100,Forrás!C84,\"\"))),\"\"))","v":""},{"$f":"IF(B11=\"Kérem válasszon!\",\"\",IF(H11=\"Igen\",IF(B11<=40,Forrás!D82,IF(AND(B11>40,B11<=80),Forrás!D83,IF(B11>=100,Forrás!D84,\"\"))),\"\"))","v":""},{"$f":"IF(OR(H11=\"Kérem válasszon!\",H11=\"Nem\"),\"\",IF(H11=\"Igen\",IF(OR(B6=\"Átkapcsoló I-0-II\",B6=\"Átkapcsoló I-I+II-II\"),2,IF(OR(C11=3,C11=4),1,2))))","v":""},""]
[null,null,null,null,null,null,null,null,null,null,"Érintésvédelmi burkolat 1P",{"$f":"IF(B11=\"Kérem válasszon!\",\"\",IF(H11=\"Igen\",IF(OR(C11=4,C11=8),IF(B11<=40,Forrás!B79,IF(AND(B11>40,B11<=80),Forrás!B80,IF(B11>=100,Forrás!B81,\"\"))),\"\"),\"\"))","v":""},{"$f":"IF(B11=\"Kérem válasszon!\",\"\",IF(H11=\"Igen\",IF(OR(C11=4,C11=8),IF(B11<=40,Forrás!C79,IF(AND(B11>40,B11<=80),Forrás!C80,IF(B11>=100,Forrás!C81,\"\"))),\"\"),\"\"))","v":""},{"$f":"IF(B11=\"Kérem válasszon!\",\"\",IF(H11=\"Igen\",IF(OR(C11=4,C11=8),IF(B11<=40,Forrás!D79,IF(AND(B11>40,B11<=80),Forrás!D80,IF(B11>=100,Forrás!D81,\"\"))),\"\"),\"\"))","v":""},{"$f":"IF(OR(H11=\"Kérem válasszon!\",H11=\"Nem\"),\"\",IF(H11=\"Igen\",IF(OR(B6=\"Átkapcsoló I-0-II\",B6=\"Átkapcsoló I-I+II-II\"),IF(OR(C11=4,C11=8),2,\"\"),IF(H11=\"Igen\",IF(C11=4,1,IF(C11=8,2,\"\")),\"\"))))","v":""},""]
[]
[null,null,null,null,null,null,null,null,null,null,"SIRCO kapcsolókészlet teljes nettó listaára:",null,null,null,null,{"$f":"IF(C11=\"Kérem válasszon!\",\"\",SUM(P12:P20))","v":""}]
[null,null,null,null,null,null,null,null,null,null,"Megrendelő lap"]
[null,null,null,null,null,null,null,null,null,null,"Kérem adja meg a kívánt mennyiséget:",null,0]
[]
[]
[null,null,null,null,null,null,null,null,null,null,"Eszközök","Leírás","Cikkszám","Nettó listaár","Mennyiség","Nettó mennyiségi listaár"]
[null,null,null,null,null,null,null,null,null,null,"Kapcsoló mechanizmus:",{"$f":"IF($M$24>0,L12,\"\")","v":""},"","",{"$f":"IF(OR($M$24<1,O12=\"\"),\"\",O12*$M$24)","v":""},{"$f":"IF(N28=\"\",\"\",N28*O28)","v":""}]
[null,null,null,null,null,null,null,null,null,null,"Pólus bővítő:","","","","",""]
[null,null,null,null,null,null,null,null,null,null,"Direkt hajtás:","","","","",""]
[null,null,null,null,null,null,null,null,null,null,"Kivezetett hajtás:","","","","",""]
[null,null,null,null,null,null,null,null,null,null,"Tengely:","","","","",""]
[null,null,null,null,null,null,null,null,null,null,"Átalakító készlet:","","","","",""]
[null,null,null,null,null,null,null,null,null,null,"Segédérintkező:","","","","",""]
[null,null,null,null,null,null,null,null,null,null,"Érintésvédelmi burkolat 3P","","","","",""]
[null,null,null,null,null,null,null,null,null,null,"Érintésvédelmi burkolat 1P","","","","",""]
[]
[null,null,null,null,null,null,null,null,null,null,"SIRCO kapcsolókészlet teljes nettó mennyiségi listaára:",null,null,null,null,{"$f":"IF(C11=\"Kérem válasszon!\",\"\",IF(D28=\"Kérem válasszon!\",\"\",SUM(P28:P36)))","v":""}]

{"sheet":"MAKRÓ engedélyezése segítség","index":2,"n_rows":0,"n_cols":0,"rows_kept":0,"cut":false,"hidden":false,"merged":[]}